Target
Sodium channel protein type 10 subunit alpha
Ligand
BDBM160962
Substrate
Meas. Tech.
Electrophysiology Assay
IC50
20±n/a nM
Citation
 Hadida-Ruah, SSAnderson, CArumugam, VAsgian, ILBear, BRTermin, APJohnson, JP Amides as modulators of sodium channels US Patent  US9108903 Publication Date 8/18/2015 
Target
Name:
Sodium channel protein type 10 subunit alpha
Synonyms:
SCNAA_RAT Sns Sodium channel protein type X alpha subunit | Voltage-gated sodium channel subunit alpha Nav1.8
Type:
Enzyme
Mol. Mass.:
219724.17
Organism:
Rattus norvegicus (Rat)
Description:
Q62968
Residue:
1956
  
Inhibitor
Name:
BDBM160962
Synonyms:
US9108903, 27
Type:
Small organic molecule
Emp. Form.:
C23H15F6NO5
Mol. Mass.:
499.3593
SMILES:
COc1cc(F)ccc1Oc1cc(ccc1C(=O)Nc1ccc(cc1)C(O)=O)C(F)(F)C(F)(F)F
: