Target
Sodium channel protein type 10 subunit alpha
Ligand
BDBM160965
Substrate
Meas. Tech.
Electrophysiology Assay
IC50
34±n/a nM
Citation
 Hadida-Ruah, SSAnderson, CArumugam, VAsgian, ILBear, BRTermin, APJohnson, JP Amides as modulators of sodium channels US Patent  US9108903 Publication Date 8/18/2015 
Target
Name:
Sodium channel protein type 10 subunit alpha
Synonyms:
SCNAA_RAT Sns Sodium channel protein type X alpha subunit | Voltage-gated sodium channel subunit alpha Nav1.8
Type:
Enzyme
Mol. Mass.:
219724.17
Organism:
Rattus norvegicus (Rat)
Description:
Q62968
Residue:
1956
  
Inhibitor
Name:
BDBM160965
Synonyms:
US9108903, 30
Type:
Small organic molecule
Emp. Form.:
C19H11Cl2FN2O4
Mol. Mass.:
421.206
SMILES:
OC(=O)c1ccc(NC(=O)c2cc(Cl)c(Cl)cc2Oc2ccc(F)cc2)cn1
: