Target
Sodium channel protein type 10 subunit alpha
Ligand
BDBM160967
Substrate
Meas. Tech.
Electrophysiology Assay
IC50
11±n/a nM
Citation
 Hadida-Ruah, SSAnderson, CArumugam, VAsgian, ILBear, BRTermin, APJohnson, JP Amides as modulators of sodium channels US Patent  US9108903 Publication Date 8/18/2015 
Target
Name:
Sodium channel protein type 10 subunit alpha
Synonyms:
SCNAA_RAT Sns Sodium channel protein type X alpha subunit | Voltage-gated sodium channel subunit alpha Nav1.8
Type:
Enzyme
Mol. Mass.:
219724.17
Organism:
Rattus norvegicus (Rat)
Description:
Q62968
Residue:
1956
  
Inhibitor
Name:
BDBM160967
Synonyms:
US9108903, 32
Type:
Small organic molecule
Emp. Form.:
C20H13Cl2FN2O4
Mol. Mass.:
435.233
SMILES:
Cc1cc(F)ccc1Oc1cc(Cl)c(Cl)cc1C(=O)Nc1ccc(nc1)C(O)=O
: