Target
Sodium channel protein type 10 subunit alpha
Ligand
BDBM160980
Substrate
Meas. Tech.
Electrophysiology Assay
IC50
64±n/a nM
Citation
 Hadida-Ruah, SSAnderson, CArumugam, VAsgian, ILBear, BRTermin, APJohnson, JP Amides as modulators of sodium channels US Patent  US9108903 Publication Date 8/18/2015 
Target
Name:
Sodium channel protein type 10 subunit alpha
Synonyms:
SCNAA_RAT Sns Sodium channel protein type X alpha subunit | Voltage-gated sodium channel subunit alpha Nav1.8
Type:
Enzyme
Mol. Mass.:
219724.17
Organism:
Rattus norvegicus (Rat)
Description:
Q62968
Residue:
1956
  
Inhibitor
Name:
BDBM160980
Synonyms:
US9108903, 45
Type:
Small organic molecule
Emp. Form.:
C22H14F6N2O5
Mol. Mass.:
500.3474
SMILES:
COc1ccccc1Oc1cc(cc(c1C(=O)Nc1ccc(nc1)C(O)=O)C(F)(F)F)C(F)(F)F
: