Target
Sodium channel protein type 10 subunit alpha
Ligand
BDBM160986
Substrate
Meas. Tech.
Electrophysiology Assay
IC50
9±n/a nM
Citation
 Hadida-Ruah, SSAnderson, CArumugam, VAsgian, ILBear, BRTermin, APJohnson, JP Amides as modulators of sodium channels US Patent  US9108903 Publication Date 8/18/2015 
Target
Name:
Sodium channel protein type 10 subunit alpha
Synonyms:
SCNAA_RAT Sns Sodium channel protein type X alpha subunit | Voltage-gated sodium channel subunit alpha Nav1.8
Type:
Enzyme
Mol. Mass.:
219724.17
Organism:
Rattus norvegicus (Rat)
Description:
Q62968
Residue:
1956
  
Inhibitor
Name:
BDBM160986
Synonyms:
US9108903, 51 | US9108903, 76
Type:
Small organic molecule
Emp. Form.:
C20H13Cl2FN2O5
Mol. Mass.:
451.232
SMILES:
COc1cc(F)ccc1Oc1cc(Cl)c(Cl)cc1C(=O)Nc1ccc(nc1)C(O)=O
: