Target
Sodium channel protein type 10 subunit alpha
Ligand
BDBM160988
Substrate
Meas. Tech.
Electrophysiology Assay
IC50
46±n/a nM
Citation
 Hadida-Ruah, SSAnderson, CArumugam, VAsgian, ILBear, BRTermin, APJohnson, JP Amides as modulators of sodium channels US Patent  US9108903 Publication Date 8/18/2015 
Target
Name:
Sodium channel protein type 10 subunit alpha
Synonyms:
SCNAA_RAT Sns Sodium channel protein type X alpha subunit | Voltage-gated sodium channel subunit alpha Nav1.8
Type:
Enzyme
Mol. Mass.:
219724.17
Organism:
Rattus norvegicus (Rat)
Description:
Q62968
Residue:
1956
  
Inhibitor
Name:
BDBM160988
Synonyms:
US9108903, 53
Type:
Small organic molecule
Emp. Form.:
C24H23FN2O4
Mol. Mass.:
422.4488
SMILES:
Cc1cc(F)ccc1Oc1cc(ccc1C(=O)Nc1ccc(nc1)C(O)=O)C(C)(C)C
: