Target
Rhomboid domain-containing protein
Ligand
BDBM50199883
Substrate
Meas. Tech.
Activity-based Protein Profiling (ABPP)
pH
7.4±0
Temperature
310.15±0 K
IC50
1.6e+4± 5e+3 nM
Citation
 Wolf, EVZeissler, AVerhelst, SH Inhibitor Fingerprinting of Rhomboid Proteases by Activity-Based Protein Profiling Reveals Inhibitor Selectivity and Rhomboid Autoprocessing. ACS Chem Biol 10:2325-33 (2015)  
Target
Name:
Rhomboid domain-containing protein
Synonyms:
Rhomboid protease (PhROM)
Type:
Protein
Mol. Mass.:
22001.99
Organism:
Pyrococcus horikoshii (Euryarchaeotes)
Description:
O59166
Residue:
197
  
Inhibitor
Name:
BDBM50199883
Synonyms:
3,4‐Dichloroisocoumarin (2) 3,4-dichloro-1H-isochromen-1-one CHEMBL24983 | cid_1609
Type:
Small organic molecule
Emp. Form.:
C9H4Cl2O2
Mol. Mass.:
215.033
SMILES:
Clc1oc(=O)c2ccccc2c1Cl
: