Target
Rhomboid domain-containing protein
Ligand
BDBM165194
Substrate
Meas. Tech.
Activity-based Protein Profiling (ABPP)
pH
7.4±0
Temperature
310.15±0 K
IC50
2.8e+4± 7e+3 nM
Citation
 Wolf, EVZeissler, AVerhelst, SH Inhibitor Fingerprinting of Rhomboid Proteases by Activity-Based Protein Profiling Reveals Inhibitor Selectivity and Rhomboid Autoprocessing. ACS Chem Biol 10:2325-33 (2015)  
Target
Name:
Rhomboid domain-containing protein
Synonyms:
Rhomboid protease (TmROM)
Type:
Protein
Mol. Mass.:
26404.64
Organism:
Thermotoga maritima (Thermotogales)
Description:
Q9WZ53
Residue:
235
  
Inhibitor
Name:
BDBM165194
Synonyms:
4‐Chloro‐7‐nitro‐3‐[(5‐phenylpentyl)oxy]isochromen‐1‐one (21)
Type:
Small organic molecule
Emp. Form.:
C20H18ClNO5
Mol. Mass.:
387.814
SMILES:
[O-][N+](=O)c1ccc2c(Cl)c(OCCCCCc3ccccc3)oc(=O)c2c1
: