Target
N-glycosylase/DNA lyase
Ligand
BDBM163681
Substrate
Meas. Tech.
Gel-based Cleavage Assay
IC50
3.3e+2± 2e+1 nM
Citation
 Donley, NJaruga, PCoskun, EDizdaroglu, MMcCullough, AKLloyd, RS Small Molecule Inhibitors of 8-Oxoguanine DNA Glycosylase-1 (OGG1). ACS Chem Biol 10:2334-43 (2015)  
Target
Name:
N-glycosylase/DNA lyase
Synonyms:
8-Oxoguanine DNA glycosylase-1 (OGG1) MUTM OGG1_HUMAN | OGH1
Type:
Protein
Mol. Mass.:
38794.33
Organism:
Homo sapiens (Human)
Description:
O15527
Residue:
345
  
Inhibitor
Name:
BDBM163681
Synonyms:
3-Chloro‐N'‐[(1E)‐(4‐fluorophenyl)methylidene]‐1‐ benzothiophene‐2‐carbohydrazide (0167)
Type:
Small organic molecule
Emp. Form.:
C16H10ClFN2OS
Mol. Mass.:
332.78
SMILES:
Fc1ccc(\C=N\NC(=O)c2sc3ccccc3c2Cl)cc1
: