Target
N-glycosylase/DNA lyase
Ligand
BDBM163687
Substrate
Meas. Tech.
Fluorescence-based Assay
pH
7.5±n/a
Temperature
310.15±n/a K
IC50
7.17e+3± 3.9e+2 nM
Comments
extracted
Citation
 Donley, NJaruga, PCoskun, EDizdaroglu, MMcCullough, AKLloyd, RS Small Molecule Inhibitors of 8-Oxoguanine DNA Glycosylase-1 (OGG1). ACS Chem Biol 10:2334-43 (2015)  
Target
Name:
N-glycosylase/DNA lyase
Synonyms:
8-Oxoguanine DNA glycosylase-1 (OGG1) MUTM OGG1_HUMAN | OGH1
Type:
Protein
Mol. Mass.:
38794.33
Organism:
Homo sapiens (Human)
Description:
O15527
Residue:
345
  
Inhibitor
Name:
BDBM163687
Synonyms:
N'‐[(1E)‐1‐(2H‐1,3‐benzodioxol‐5‐yl)ethylidene]‐3‐hydroxynaphthalene‐2‐carbohydrazide (0179)
Type:
Small organic molecule
Emp. Form.:
C20H16N2O4
Mol. Mass.:
348.352
SMILES:
C\C(=N/NC(=O)c1cc2ccccc2cc1O)c1ccc2OCOc2c1
: