Target
Discoidin domain-containing receptor 2
Ligand
BDBM50297825
Substrate
Meas. Tech.
Z'-Lyte assaytion Assay
IC50
19±0.0 nM
Citation
 Terai, HTan, LBeauchamp, EMHatcher, JMLiu, QMeyerson, MGray, NSHammerman, PS Characterization of DDR2 Inhibitors for the Treatment of DDR2 Mutated Nonsmall Cell Lung Cancer. ACS Chem Biol 10:2687-96 (2015)  
Target
Name:
Discoidin domain-containing receptor 2
Synonyms:
DDR2 Discoidin domain receptor 2 (DDR2) Discoidin domain-containing receptor 2 (DDR2) NTRKR3 TYRO10
Type:
Protein
Mol. Mass.:
96717.07
Organism:
Homo sapiens (Human)
Description:
Q16832
Residue:
855
  
Inhibitor
Name:
BDBM50297825
Synonyms:
5-(2-methyl-5-(3-(trifluoromethyl)phenylcarbamoyl)phenylamino)nicotinamide 5-[(2-methyl-5-{[3-(trifluoromethyl)phenyl]carbamoyl}phenyl)amino]pyridine-3-carboxamide | CHEMBL552425
Type:
Small organic molecule
Emp. Form.:
C21H17F3N4O2
Mol. Mass.:
414.3805
SMILES:
Cc1ccc(cc1Nc1cncc(c1)C(N)=O)C(=O)Nc1cccc(c1)C(F)(F)F
: