Target
Proto-oncogene tyrosine-protein kinase Src
Ligand
BDBM50297825
Substrate
Meas. Tech.
Z'-Lyte assaytion Assay
IC50
753±0.0 nM
Citation
 Terai, HTan, LBeauchamp, EMHatcher, JMLiu, QMeyerson, MGray, NSHammerman, PS Characterization of DDR2 Inhibitors for the Treatment of DDR2 Mutated Nonsmall Cell Lung Cancer. ACS Chem Biol 10:2687-96 (2015)  
Target
Name:
Proto-oncogene tyrosine-protein kinase Src
Synonyms:
Calmodulin/Proto-oncogene tyrosine-protein kinase Src Proto-oncogene c-Src SRC SRC_HUMAN V-src sarcoma (Schmidt-Ruppin A-2) viral oncogene homolog (avian) p60-Src | pp60c-src
Type:
Protein
Mol. Mass.:
59838.60
Organism:
Homo sapiens (Human)
Description:
P12931
Residue:
536
  
Inhibitor
Name:
BDBM50297825
Synonyms:
5-(2-methyl-5-(3-(trifluoromethyl)phenylcarbamoyl)phenylamino)nicotinamide 5-[(2-methyl-5-{[3-(trifluoromethyl)phenyl]carbamoyl}phenyl)amino]pyridine-3-carboxamide | CHEMBL552425
Type:
Small organic molecule
Emp. Form.:
C21H17F3N4O2
Mol. Mass.:
414.3805
SMILES:
Cc1ccc(cc1Nc1cncc(c1)C(N)=O)C(=O)Nc1cccc(c1)C(F)(F)F
: