Target
Nitric oxide synthase, inducible
Ligand
BDBM166692
Substrate
Meas. Tech.
iNOS Activity Assay
Ki
2.587e+5± 5.7e+3 nM
Citation
 Oliveira, BLMorais, MMendes, FMoreira, ISCordeiro, CFernandes, PARamos, MJAlberto, RSantos, ICorreia, JD Re(I) and Tc(I) complexes for targeting nitric oxide synthase: influence of the chelator in the affinity for the enzyme. Chem Biol Drug Des 86:1072-86 (2015)  
Target
Name:
Nitric oxide synthase, inducible
Synonyms:
Inducible NO synthase Inducible nitric oxide synthase (iNOS) MAC-NOS NOS type II Nitric Oxide Synthase, inducible Nos2
Type:
Enzyme
Mol. Mass.:
130595.79
Organism:
Mus musculus (mouse)
Description:
Recombinant enzyme overexpressed in E. coli.
Residue:
1144
  
Inhibitor
Name:
BDBM166692
Synonyms:
4-{6-[(1-carboxylato-4-{[(carboxylatoamino)(iminiumyl)methyl]amino}butyl)carbamoyl]hexyl}-1,1,1-triformyl-3-oxo-2-oxa-6,7-diaza-1-rhenabicyclo[2.2.1]heptane-6,7-diium (Re6)
Type:
Small organic molecule
Emp. Form.:
C20H33N6O10Re
Mol. Mass.:
703.717
SMILES:
[O-]C(=O)NC(=[NH2+])NCCCC(NC(=O)CCCCCCC12C[NH2+][Re]([NH2+]1)(OC2=O)(C=O)(C=O)C=O)C([O-])=O
: