Target
Sodium-dependent dopamine transporter
Ligand
BDBM60503
Substrate
Meas. Tech.
Binding Assay
pH
7.4±n/a
Ki
39.5±n/a nM
Comments
extracted
Citation
 Molino, BFLiu, SGuzzo, PRBeck, JP Aryl- and heteroaryl-substituted tetrahydroisoquinolines and use thereof to block reuptake of norepinephrine, dopamine, and serotonin US Patent  US9085531 Publication Date 7/21/2015 
Target
Name:
Sodium-dependent dopamine transporter
Synonyms:
DA transporter DAT1 Dopamine transporter protein (DAT) SC6A3_HUMAN Sodium-dependent dopamine transporter Solute carrier family 6 member 3
Type:
Multi-pass membrane protein
Mol. Mass.:
68497.11
Organism:
Homo sapiens (Human)
Description:
Q01959
Residue:
620
  
Inhibitor
Name:
BDBM60503
Synonyms:
US9085531, 56
Type:
Emp. Form.:
C21H21N
Mol. Mass.:
287.3981
SMILES:
CN1CC(c2ccc3ccccc3c2)c2c(C)cccc2C1
: