Target
Sodium-dependent dopamine transporter
Ligand
BDBM60513
Substrate
Meas. Tech.
Binding Assay
pH
7.4±n/a
Ki
59.7±n/a nM
Comments
extracted
Citation
 Molino, BFLiu, SGuzzo, PRBeck, JP Aryl- and heteroaryl-substituted tetrahydroisoquinolines and use thereof to block reuptake of norepinephrine, dopamine, and serotonin US Patent  US9085531 Publication Date 7/21/2015 
Target
Name:
Sodium-dependent dopamine transporter
Synonyms:
DA transporter DAT1 Dopamine transporter protein (DAT) SC6A3_HUMAN Sodium-dependent dopamine transporter Solute carrier family 6 member 3
Type:
Multi-pass membrane protein
Mol. Mass.:
68497.11
Organism:
Homo sapiens (Human)
Description:
Q01959
Residue:
620
  
Inhibitor
Name:
BDBM60513
Synonyms:
US9085531, 137
Type:
Emp. Form.:
C24H21N3
Mol. Mass.:
351.4436
SMILES:
CN1CC(c2ccc3ccccc3c2)c2ccc(cc2C1)-c1cccnn1
: