Target
Sodium-dependent dopamine transporter
Ligand
BDBM170439
Substrate
Meas. Tech.
Binding Assay
pH
7.4±n/a
Ki
14.3±n/a nM
Comments
extracted
Citation
 Molino, BFLiu, SGuzzo, PRBeck, JP Aryl- and heteroaryl-substituted tetrahydroisoquinolines and use thereof to block reuptake of norepinephrine, dopamine, and serotonin US Patent  US9085531 Publication Date 7/21/2015 
Target
Name:
Sodium-dependent dopamine transporter
Synonyms:
DA transporter DAT1 Dopamine transporter protein (DAT) SC6A3_HUMAN Sodium-dependent dopamine transporter Solute carrier family 6 member 3
Type:
Multi-pass membrane protein
Mol. Mass.:
68497.11
Organism:
Homo sapiens (Human)
Description:
Q01959
Residue:
620
  
Inhibitor
Name:
BDBM170439
Synonyms:
US9085531, 21
Type:
Small organic molecule
Emp. Form.:
C18H17NS
Mol. Mass.:
279.399
SMILES:
CN1CC(c2cc3ccccc3s2)c2ccccc2C1
: