Target
Sodium-dependent dopamine transporter
Ligand
BDBM170442
Substrate
Meas. Tech.
Binding Assay
pH
7.4±n/a
Ki
4.5±n/a nM
Comments
extracted
Citation
 Molino, BFLiu, SGuzzo, PRBeck, JP Aryl- and heteroaryl-substituted tetrahydroisoquinolines and use thereof to block reuptake of norepinephrine, dopamine, and serotonin US Patent  US9085531 Publication Date 7/21/2015 
Target
Name:
Sodium-dependent dopamine transporter
Synonyms:
DA transporter DAT1 Dopamine transporter protein (DAT) SC6A3_HUMAN Sodium-dependent dopamine transporter Solute carrier family 6 member 3
Type:
Multi-pass membrane protein
Mol. Mass.:
68497.11
Organism:
Homo sapiens (Human)
Description:
Q01959
Residue:
620
  
Inhibitor
Name:
BDBM170442
Synonyms:
US9085531, 19
Type:
Small organic molecule
Emp. Form.:
C18H17NO
Mol. Mass.:
263.3337
SMILES:
CN1CC(c2ccccc2C1)c1cccc2ccoc12
: