Target
Sodium-dependent dopamine transporter
Ligand
BDBM170446
Substrate
Meas. Tech.
Binding Assay
pH
7.4±n/a
Ki
3.8±n/a nM
Comments
extracted
Citation
 Molino, BFLiu, SGuzzo, PRBeck, JP Aryl- and heteroaryl-substituted tetrahydroisoquinolines and use thereof to block reuptake of norepinephrine, dopamine, and serotonin US Patent  US9085531 Publication Date 7/21/2015 
Target
Name:
Sodium-dependent dopamine transporter
Synonyms:
DA transporter DAT1 Dopamine transporter protein (DAT) SC6A3_HUMAN Sodium-dependent dopamine transporter Solute carrier family 6 member 3
Type:
Multi-pass membrane protein
Mol. Mass.:
68497.11
Organism:
Homo sapiens (Human)
Description:
Q01959
Residue:
620
  
Inhibitor
Name:
BDBM170446
Synonyms:
US9085531, 49
Type:
Small organic molecule
Emp. Form.:
C18H18N2
Mol. Mass.:
262.3489
SMILES:
CN1CC(c2ccc3[nH]ccc3c2)c2ccccc2C1
: