Target
Sodium-dependent dopamine transporter
Ligand
BDBM170454
Substrate
Meas. Tech.
Binding Assay
pH
7.4±n/a
Ki
4.4±n/a nM
Comments
extracted
Citation
 Molino, BFLiu, SGuzzo, PRBeck, JP Aryl- and heteroaryl-substituted tetrahydroisoquinolines and use thereof to block reuptake of norepinephrine, dopamine, and serotonin US Patent  US9085531 Publication Date 7/21/2015 
Target
Name:
Sodium-dependent dopamine transporter
Synonyms:
DA transporter DAT1 Dopamine transporter protein (DAT) SC6A3_HUMAN Sodium-dependent dopamine transporter Solute carrier family 6 member 3
Type:
Multi-pass membrane protein
Mol. Mass.:
68497.11
Organism:
Homo sapiens (Human)
Description:
Q01959
Residue:
620
  
Inhibitor
Name:
BDBM170454
Synonyms:
US9085531, 102
Type:
Small organic molecule
Emp. Form.:
C21H24N2S
Mol. Mass.:
336.494
SMILES:
CN(C)Cc1ccc2C(CN(C)Cc2c1)c1ccc2sccc2c1
: