Target
Complement factor D
Ligand
BDBM50400275
Substrate
Meas. Tech.
In Vitro Assay
pH
7.5±n/a
Temperature
298.15±n/a K
IC50
3±n/a nM
Comments
extracted
Citation
 Altmann, EHommel, ULorthiois, ELMaibaum, JKOstermann, NQuancard, JRandl, SARogel, OSimic, OVulpetti, A Complement pathway modulators and uses thereof US Patent  US9085555 Publication Date 7/21/2015 
Target
Name:
Complement factor D
Synonyms:
Adipsin CFAD_HUMAN DF Properdin factor D
Type:
Protein
Mol. Mass.:
27039.19
Organism:
Homo sapiens (Human)
Description:
P00746
Residue:
253
  
Inhibitor
Name:
BDBM50400275
Synonyms:
CHEMBL2180766 | US9085555, 127
Type:
Small organic molecule
Emp. Form.:
C29H31ClFN5O5
Mol. Mass.:
584.038
SMILES:
CC(C)(C)OC(=O)Cc1ccc2c(NC(=O)N3[C@@H]4C[C@@H]4C[C@H]3C(=O)NCc3cccc(Cl)c3F)cn(C(N)=O)c2c1
: