Target
Complement factor D
Ligand
BDBM170870
Substrate
Meas. Tech.
In Vitro Assay
pH
7.5±n/a
Temperature
298.15±n/a K
IC50
7±n/a nM
Comments
extracted
Citation
 Altmann, EHommel, ULorthiois, ELMaibaum, JKOstermann, NQuancard, JRandl, SARogel, OSimic, OVulpetti, A Complement pathway modulators and uses thereof US Patent  US9085555 Publication Date 7/21/2015 
Target
Name:
Complement factor D
Synonyms:
Adipsin CFAD_HUMAN DF Properdin factor D
Type:
Protein
Mol. Mass.:
27039.19
Organism:
Homo sapiens (Human)
Description:
P00746
Residue:
253
  
Inhibitor
Name:
BDBM170870
Synonyms:
US9085555, 298
Type:
Small organic molecule
Emp. Form.:
C23H20F5N5O5
Mol. Mass.:
541.4274
SMILES:
COc1ccc2n(cc(NC(=O)N3C[C@H](F)C[C@H]3C(=O)Nc3cccc(OC(F)(F)F)c3F)c2c1)C(N)=O
: