Target
Complement factor D
Ligand
BDBM170878
Substrate
Meas. Tech.
In Vitro Assay
pH
7.5±n/a
Temperature
298.15±n/a K
IC50
4±n/a nM
Comments
extracted
Citation
 Altmann, EHommel, ULorthiois, ELMaibaum, JKOstermann, NQuancard, JRandl, SARogel, OSimic, OVulpetti, A Complement pathway modulators and uses thereof US Patent  US9085555 Publication Date 7/21/2015 
Target
Name:
Complement factor D
Synonyms:
Adipsin CFAD_HUMAN DF Properdin factor D
Type:
Protein
Mol. Mass.:
27039.19
Organism:
Homo sapiens (Human)
Description:
P00746
Residue:
253
  
Inhibitor
Name:
BDBM170878
Synonyms:
US9085555, 306
Type:
Small organic molecule
Emp. Form.:
C27H27ClFN5O5
Mol. Mass.:
555.985
SMILES:
CCOC(=O)Cc1ccc2n(cc(NC(=O)N3[C@@H]4C[C@@H]4C[C@H]3C(=O)NCc3cccc(Cl)c3F)c2c1)C(N)=O
: