Target
Complement factor D
Ligand
BDBM50400273
Substrate
Meas. Tech.
In Vitro Assay
pH
7.5±n/a
Temperature
298.15±n/a K
IC50
2±n/a nM
Comments
extracted
Citation
 Altmann, EHommel, ULorthiois, ELMaibaum, JKOstermann, NQuancard, JRandl, SARogel, OSimic, OVulpetti, A Complement pathway modulators and uses thereof US Patent  US9085555 Publication Date 7/21/2015 
Target
Name:
Complement factor D
Synonyms:
Adipsin CFAD_HUMAN DF Properdin factor D
Type:
Protein
Mol. Mass.:
27039.19
Organism:
Homo sapiens (Human)
Description:
P00746
Residue:
253
  
Inhibitor
Name:
BDBM50400273
Synonyms:
CHEMBL2180764 | US9085555, 375
Type:
Small organic molecule
Emp. Form.:
C25H24ClF2N5O6
Mol. Mass.:
563.938
SMILES:
C[C@@]1(F)C[C@H](N(C1)C(=O)Nc1cn(C(N)=O)c2ccc(OCC(O)=O)cc12)C(=O)NCc1cccc(Cl)c1F
: