Target
Complement factor D
Ligand
BDBM170962
Substrate
Meas. Tech.
In Vitro Assay
pH
7.5±n/a
Temperature
298.15±n/a K
IC50
7±n/a nM
Comments
extracted
Citation
 Altmann, EHommel, ULorthiois, ELMaibaum, JKOstermann, NQuancard, JRandl, SARogel, OSimic, OVulpetti, A Complement pathway modulators and uses thereof US Patent  US9085555 Publication Date 7/21/2015 
Target
Name:
Complement factor D
Synonyms:
Adipsin CFAD_HUMAN DF Properdin factor D
Type:
Protein
Mol. Mass.:
27039.19
Organism:
Homo sapiens (Human)
Description:
P00746
Residue:
253
  
Inhibitor
Name:
BDBM170962
Synonyms:
US9085555, 392
Type:
Small organic molecule
Emp. Form.:
C23H21ClFN5O4
Mol. Mass.:
485.895
SMILES:
NC(=O)n1cc(NC(=O)N2C3CC3C[C@H]2C(=O)NCc2cccc(Cl)c2F)c2ccc(O)cc12
: