Target
Complement factor D
Ligand
BDBM171002
Substrate
Meas. Tech.
In Vitro Assay
pH
7.5±n/a
Temperature
298.15±n/a K
IC50
7±n/a nM
Comments
extracted
Citation
 Altmann, EHommel, ULorthiois, ELMaibaum, JKOstermann, NQuancard, JRandl, SARogel, OSimic, OVulpetti, A Complement pathway modulators and uses thereof US Patent  US9085555 Publication Date 7/21/2015 
Target
Name:
Complement factor D
Synonyms:
Adipsin CFAD_HUMAN DF Properdin factor D
Type:
Protein
Mol. Mass.:
27039.19
Organism:
Homo sapiens (Human)
Description:
P00746
Residue:
253
  
Inhibitor
Name:
BDBM171002
Synonyms:
US9085555, 432
Type:
Small organic molecule
Emp. Form.:
C21H20ClFN6O3
Mol. Mass.:
458.873
SMILES:
NC(=O)n1cc(NC(=O)N2NCC[C@H]2C(=O)NCc2cccc(Cl)c2F)c2ccccc12
: