Target
Prostaglandin D2 receptor 2
Ligand
BDBM173208
Substrate
Meas. Tech.
Radioligand Displacement Assay
pH
7±n/a
Temperature
298.15±n/a K
IC50
420±n/a nM
Comments
extracted
Citation
 Aissaoui, HBoss, CGabillet, JRichard-Bildstein, SSiegrist, R 7-(heteroaryl-amino)-6,7,8,9-tetrahydropyrido[1,2-a]indol acetic acid derivatives and their use as prostaglandin D2 receptor modulators US Patent  US9096595 Publication Date 8/4/2015 
Target
Name:
Prostaglandin D2 receptor 2
Synonyms:
CD_antigen=CD294 Chemoattractant Receptor-homologous molecule expressed on T-helper type 2 cells (CRTH2) Chemoattractant receptor-homologous molecule expressed on Th2 cells (CRTH2) G protein-coupled receptor 44 GPR44 PTGDR2 Prostaglandin D2 receptor 2 | Prostaglandin D2 receptor 2 (PGD2)
Type:
Enzyme
Mol. Mass.:
43295.45
Organism:
Homo sapiens (Human)
Description:
Q9Y5Y4
Residue:
395
  
Inhibitor
Name:
BDBM173208
Synonyms:
US9096595, 11
Type:
Small organic molecule
Emp. Form.:
C20H21FN4O3
Mol. Mass.:
384.4041
SMILES:
COc1ccc2n3CC(CCc3c(CC(O)=O)c2c1)N(C)c1ncc(F)cn1
: