Target
Epidermal growth factor receptor [L858R]
Ligand
BDBM173463
Substrate
Meas. Tech.
Inhibition Assay
IC50
0.6±n/a nM
Citation
 Yang, SWei, Y Arylamino purine derivatives, preparation method and pharmaceutical use thereof US Patent  US9096601 Publication Date 8/4/2015 
Target
Name:
Epidermal growth factor receptor [L858R]
Synonyms:
EGFR EGFR_HUMAN ERBB1 Epidermal growth factor receptor (L858R) HER1
Type:
Mol. Mass.:
134323.62
Organism:
Homo sapiens (Human)
Description:
P00533[L858R]
Residue:
1210
  
Inhibitor
Name:
BDBM173463
Synonyms:
US9096601, 8-38
Type:
Small organic molecule
Emp. Form.:
C23H23N7O
Mol. Mass.:
413.475
SMILES:
CC(C)n1c(Nc2ccccc2)nc2cnc(Nc3cccc(NC(=O)C=C)c3)nc12
: