Target
Mu-type opioid receptor
Ligand
BDBM173468
Substrate
Meas. Tech.
Radioligand Dose-Displacement Binding Assay
pH
7.4±n/a
Temperature
323.15±n/a K
Ki
2.29±0.7 nM
Comments
extracted
Citation
 Kyle, DJ Quarternized buprenorphine analogs US Patent  US9096606 Publication Date 8/4/2015 
Target
Name:
Mu-type opioid receptor
Synonyms:
M-OR-1 MOR-1 MUOR1 Mu opiate receptor OPRM1 hMOP | mu-type opioid receptor isoform MOR-1
Type:
G Protein-Coupled Receptor (GPCR)
Mol. Mass.:
44789.51
Organism:
Homo sapiens (Human)
Description:
P35372
Residue:
400
  
Inhibitor
Name:
BDBM173468
Synonyms:
US9096606, 5
Type:
Small organic molecule
Emp. Form.:
C34H40NO4S
Mol. Mass.:
558.751
SMILES:
CO[C@]12CC[C@@]3(C[C@@H]1COCc1cc4ccccc4s1)[C@H]1Cc4ccc(O)c5O[C@@H]2[C@]3(CC[N]1(C)CC1CC1)c45
: