Target
Delta-type opioid receptor
Ligand
BDBM173470
Substrate
Meas. Tech.
Radioligand Dose-Displacement Binding Assay
pH
7.4±n/a
Ki
18.82±1.7 nM
Comments
extracted
Citation
 Kyle, DJ Quarternized buprenorphine analogs US Patent  US9096606 Publication Date 8/4/2015 
Target
Name:
Delta-type opioid receptor
Synonyms:
D-OR-1 Delta opioid receptor OPIATE Delta OPRD1 OPRK1 | opioid receptor, delta 1
Type:
G Protein-Coupled Receptor (GPCR)
Mol. Mass.:
40382.98
Organism:
Homo sapiens (Human)
Description:
Competition binding assays were carried out using membrane preparations from transfected HN9.10 cells that constitutively expressed the delta opioid receptor.
Residue:
372
  
Inhibitor
Name:
BDBM173470
Synonyms:
US9096606, 7
Type:
Small organic molecule
Emp. Form.:
C32H40NO4
Mol. Mass.:
502.6643
SMILES:
CO[C@]12CC[C@@]3(C[C@@H]1COCc1ccccc1)[C@H]1Cc4ccc(O)c5O[C@@H]2[C@]3(CC[N]1(C)CC1CC1)c45
: