Target
Ribonuclease pancreatic
Ligand
BDBM173612
Substrate
Meas. Tech.
Ribonuclease Activity Assay
Temperature
303.15±n/a K
Ki
9.85e+4± 5.3e+3 nM
Comments
extracted
Citation
 Chatzileontiadou, DSParmenopoulou, VManta, SKantsadi, ALKylindri, PGriniezaki, MKontopoulou, FTelopoulou, AProkova, HPanagopoulos, DBoix, EBalatsos, NAKomiotis, DLeonidas, DD Triazole double-headed ribonucleosides as inhibitors of eosinophil derived neurotoxin. Bioorg Chem 63:152-65 (2015)  
Target
Name:
Ribonuclease pancreatic
Synonyms:
CAM-RNase A RNASE1 RNS1
Type:
Enzyme
Mol. Mass.:
16468.79
Organism:
Bison bison (American bison)
Description:
carboxamidomethylated RNase A
Residue:
150
  
Inhibitor
Name:
BDBM173612
Synonyms:
9-[3'-[4-[(Cytosine-1-yl)methyl]-1,2,3-triazol-1-yl]-b-D-ribofuranosyl]adenine (11c)
Type:
Small organic molecule
Emp. Form.:
C17H21N11O4
Mol. Mass.:
443.4199
SMILES:
NC1=NC=NC2C1N=CN2[C@@H]1O[C@H](CO)[C@@H](C1O)n1cc(Cn2ccc(N)nc2=O)nn1
: