Target
Prostaglandin G/H synthase 1
Ligand
BDBM175285
Substrate
Meas. Tech.
In vitro Cyclooxygenase Inhibition Assay
IC50
1.05e+4±n/a nM
Citation
 Abdellatif, KRAbdelgawad, MAElshemy, HAAlsayed, SS Design, synthesis and biological screening of new 4-thiazolidinone derivatives with promising COX-2 selectivity, anti-inflammatory activity and gastric safety profile. Bioorg Chem 64:1-12 (2016)  
Target
Name:
Prostaglandin G/H synthase 1
Synonyms:
COX1 Cyclooxygenase-1 (COX-1) PTGS1 | Prostaglandin G/H synthase (cyclooxygenase)
Type:
Protein
Mol. Mass.:
68868.60
Organism:
Ovis aries (Sheep)
Description:
Residue:
600
  
Inhibitor
Name:
BDBM175285
Synonyms:
3-(4-Aminosulfonylphenylamino)-2-(4-chlorophenyl)-5-methyl-4-thiazolidinone (8c)
Type:
Small organic molecule
Emp. Form.:
C16H16ClN3O3S2
Mol. Mass.:
397.9
SMILES:
CC1SC(N(Nc2ccc(cc2)S(N)(=O)=O)C1=O)c1ccc(Cl)cc1
: