Target
Prostaglandin G/H synthase 1
Ligand
BDBM60580
Substrate
Meas. Tech.
In vitro Cyclooxygenase Inhibition Assay
IC50
1.18e+4±n/a nM
Citation
 Abdellatif, KRAbdelgawad, MAElshemy, HAAlsayed, SS Design, synthesis and biological screening of new 4-thiazolidinone derivatives with promising COX-2 selectivity, anti-inflammatory activity and gastric safety profile. Bioorg Chem 64:1-12 (2016)  
Target
Name:
Prostaglandin G/H synthase 1
Synonyms:
COX1 Cyclooxygenase-1 (COX-1) PTGS1 | Prostaglandin G/H synthase (cyclooxygenase)
Type:
Protein
Mol. Mass.:
68868.60
Organism:
Ovis aries (Sheep)
Description:
Residue:
600
  
Inhibitor
Name:
BDBM60580
Synonyms:
3-(4-Aminosulfonylphenylamino)-5-methyl-2-(4-trifluoromethylphenyl)-4-thiazol-idinone (8e)
Type:
Emp. Form.:
C17H16F3N3O3S2
Mol. Mass.:
431.452
SMILES:
CC1SC(N(Nc2ccc(cc2)S(N)(=O)=O)C1=O)c1ccc(cc1)C(F)(F)F
: