Target
Prostaglandin G/H synthase 2 [E165G]
Ligand
BDBM175281
Substrate
Meas. Tech.
In vitro Cyclooxygenase Inhibition Assay
IC50
6.1e+3±n/a nM
Citation
 Abdellatif, KRAbdelgawad, MAElshemy, HAAlsayed, SS Design, synthesis and biological screening of new 4-thiazolidinone derivatives with promising COX-2 selectivity, anti-inflammatory activity and gastric safety profile. Bioorg Chem 64:1-12 (2016)  
Target
Name:
Prostaglandin G/H synthase 2 [E165G]
Synonyms:
COX2 PGH2_HUMAN | PTGS2
Type:
Protein
Mol. Mass.:
68932.84
Organism:
Homo sapiens (Human)
Description:
P35354[E165G]
Residue:
604
  
Inhibitor
Name:
BDBM175281
Synonyms:
2-(4-(4-Isobutylphenyl)thiazol-2-ylimino)thiazolidin-4-one (4b)
Type:
Small organic molecule
Emp. Form.:
C16H17N3OS2
Mol. Mass.:
331.456
SMILES:
CC(C)Cc1ccc(cc1)-c1csc(N=C2NC(=O)CS2)n1
: