Target
Prostaglandin G/H synthase 2 [E165G]
Ligand
BDBM175284
Substrate
Meas. Tech.
In vitro Cyclooxygenase Inhibition Assay
IC50
4.8e+3±n/a nM
Citation
 Abdellatif, KRAbdelgawad, MAElshemy, HAAlsayed, SS Design, synthesis and biological screening of new 4-thiazolidinone derivatives with promising COX-2 selectivity, anti-inflammatory activity and gastric safety profile. Bioorg Chem 64:1-12 (2016)  
Target
Name:
Prostaglandin G/H synthase 2 [E165G]
Synonyms:
COX2 PGH2_HUMAN | PTGS2
Type:
Protein
Mol. Mass.:
68932.84
Organism:
Homo sapiens (Human)
Description:
P35354[E165G]
Residue:
604
  
Inhibitor
Name:
BDBM175284
Synonyms:
3-(4-Aminosulfonylphenylamino)-5-methyl-2-(4-methylphenyl)-4-thiazolidinone (8b)
Type:
Small organic molecule
Emp. Form.:
C17H19N3O3S2
Mol. Mass.:
377.481
SMILES:
CC1SC(N(Nc2ccc(cc2)S(N)(=O)=O)C1=O)c1ccc(C)cc1
: