Target
Prostaglandin G/H synthase 2 [E165G]
Ligand
BDBM175286
Substrate
Meas. Tech.
In vitro Cyclooxygenase Inhibition Assay
IC50
1.9e+3±n/a nM
Citation
 Abdellatif, KRAbdelgawad, MAElshemy, HAAlsayed, SS Design, synthesis and biological screening of new 4-thiazolidinone derivatives with promising COX-2 selectivity, anti-inflammatory activity and gastric safety profile. Bioorg Chem 64:1-12 (2016)  
Target
Name:
Prostaglandin G/H synthase 2 [E165G]
Synonyms:
COX2 PGH2_HUMAN | PTGS2
Type:
Protein
Mol. Mass.:
68932.84
Organism:
Homo sapiens (Human)
Description:
P35354[E165G]
Residue:
604
  
Inhibitor
Name:
BDBM175286
Synonyms:
3-(4-Aminosulfonylphenylamino)-2-(4-fluorophenyl)-5-methyl-4-thiazolidinone (8d)
Type:
Small organic molecule
Emp. Form.:
C16H16FN3O3S2
Mol. Mass.:
381.445
SMILES:
CC1SC(N(Nc2ccc(cc2)S(N)(=O)=O)C1=O)c1ccc(F)cc1
: