Target
Sodium channel protein type 9 subunit alpha
Ligand
BDBM176526
Substrate
Meas. Tech.
FLIPR or FLIPRTETRA Sodium Dye with KCl Assay
Temperature
310.15±n/a K
IC50
2310±620 nM
Comments
extracted
Citation
 Kyle, DJNi, CPark, MTafesse, L Pyridine compounds as sodium channel blockers US Patent  US9120752 Publication Date 9/1/2015 
Target
Name:
Sodium channel protein type 9 subunit alpha
Synonyms:
NENA Peripheral sodium channel 1 SCN9A_HUMAN Voltage-gated sodium channel subunit Nav1.7 hNE-Na
Type:
Protein
Mol. Mass.:
226375.97
Organism:
Homo sapiens (Human)
Description:
Q15858
Residue:
1988
  
Inhibitor
Name:
BDBM176526
Synonyms:
US9120752, 58 | US9765029, 58
Type:
Small organic molecule
Emp. Form.:
C31H27FN4O6S
Mol. Mass.:
602.633
SMILES:
OC[C@@H](O)c1cc(nc(c1)-c1ccc(Oc2ccc(F)cc2)cc1)C(=O)N1CCN(CC1)S(=O)(=O)c1cccc(c1)C#N
: