Target
Hematopoietic prostaglandin D synthase
Ligand
BDBM179403
Substrate
Meas. Tech.
Fluorescence Polarization Binding Assay (FPBA)
Temperature
298.15±n/a K
IC50
188±n/a nM
Comments
extracted
Citation
 Endres, GWLee, PHOlson, KLKramer, JBCiske, FLBarrett, SD Multiheteroaryl compounds as inhibitors of H-PGDS and their use for treating prostaglandin D2 mediated diseases US Patent  US9126973 Publication Date 9/8/2015 
Target
Name:
Hematopoietic prostaglandin D synthase
Synonyms:
GSTS Glutathione-requiring prostaglandin D synthase HPGDS Hematopoietic prostaglandin D synthase Hematopoietic prostaglandin D synthase (HPGDS) PTGDS2 Prostaglandin D Synthase
Type:
Enzyme
Mol. Mass.:
23341.07
Organism:
Homo sapiens (Human)
Description:
The protein was expressed in E. coli strain BL21(DE3) with an N-terminal 6-His tag.
Residue:
199
  
Inhibitor
Name:
BDBM179403
Synonyms:
US9126973, 8
Type:
Small organic molecule
Emp. Form.:
C19H13FN4
Mol. Mass.:
316.3317
SMILES:
Fc1cccc(c1)-c1ncc([nH]1)-c1cnc(nc1)-c1ccccc1
: