Target
Vascular endothelial growth factor receptor 2
Ligand
BDBM5331
Substrate
poly-Glu/Tyr
Meas. Tech.
Kinase Inhibition Assay
pH
7.4±n/a
Temperature
295.15±n/a K
IC50
8±n/a nM
Citation
 Fraley, MEArrington, KLBuser, CACiecko, PAColl, KEFernandes, CHartman, GDHoffman, WFLynch, JJMcFall, RCRickert, KSingh, RSmith, SThomas, KAWong, BK Optimization of the indolyl quinolinone class of KDR (VEGFR-2) kinase inhibitors: effects of 5-amido- and 5-sulphonamido-indolyl groups on pharmacokinetics and hERG binding. Bioorg Med Chem Lett 14:351-5 (2004)  
Target
Name:
Vascular endothelial growth factor receptor 2
Synonyms:
CD_antigen=CD309 Fetal liver kinase 1 (FLK-1) KDR Protein-tyrosine kinase receptor Flk-1 VEGFR-2 VEGFR2 Vascular Endothelial Growth Factor Receptor Kinase 2 Vascular endothelial growth factor receptor 2 (KDR) Vascular endothelial growth factor receptor 2 (VEGFR2) Vascular endothelial growth factor receptor-2 (VEGFR-2)
Type:
Receptor Tyrosine Kinase
Mol. Mass.:
151510.97
Organism:
Homo sapiens (Human)
Description:
P35968
Residue:
1356
  
Inhibitor
Name:
BDBM5331
Synonyms:
1-(3-{[2-(2-oxo-1,2-dihydroquinolin-3-yl)-1H-indol-5-yl]oxy}propyl)piperidine-4-carboxylic acid | indolyl quinolinone deriv. 8
Type:
Small organic molecule
Emp. Form.:
C26H27N3O4
Mol. Mass.:
445.5103
SMILES:
OC(=O)C1CCN(CCCOc2ccc3[nH]c(cc3c2)-c2cc3ccccc3[nH]c2=O)CC1
:
Substrate
Name:
poly-Glu/Tyr
Synonyms:
Type:
Random Copolymer
Mol. Mass.:
358.43
Organism:
Description:
poly-Glu/Tyr (4:1). 25 uM ATP/10 uCi [gamma-33P]ATP as co-substrate.
Residue:
3
NA