Target
Vascular endothelial growth factor receptor 2
Ligand
BDBM5337
Substrate
poly-Glu/Tyr
Meas. Tech.
Kinase Inhibition Assay
pH
7.4±n/a
Temperature
295.15±n/a K
IC50
10±n/a nM
Citation
 Fraley, MEArrington, KLBuser, CACiecko, PAColl, KEFernandes, CHartman, GDHoffman, WFLynch, JJMcFall, RCRickert, KSingh, RSmith, SThomas, KAWong, BK Optimization of the indolyl quinolinone class of KDR (VEGFR-2) kinase inhibitors: effects of 5-amido- and 5-sulphonamido-indolyl groups on pharmacokinetics and hERG binding. Bioorg Med Chem Lett 14:351-5 (2004)  
Target
Name:
Vascular endothelial growth factor receptor 2
Synonyms:
CD_antigen=CD309 Fetal liver kinase 1 (FLK-1) KDR Protein-tyrosine kinase receptor Flk-1 VEGFR-2 VEGFR2 Vascular Endothelial Growth Factor Receptor Kinase 2 Vascular endothelial growth factor receptor 2 (KDR) Vascular endothelial growth factor receptor 2 (VEGFR2) Vascular endothelial growth factor receptor-2 (VEGFR-2)
Type:
Receptor Tyrosine Kinase
Mol. Mass.:
151510.97
Organism:
Homo sapiens (Human)
Description:
P35968
Residue:
1356
  
Inhibitor
Name:
BDBM5337
Synonyms:
3-{5-[(4-methylpiperazine-1-)sulfonyl]-1H-indol-2-yl}-1,2-dihydroquinolin-2-one | indolyl quinolinone deriv. 14
Type:
Small organic molecule
Emp. Form.:
C22H22N4O3S
Mol. Mass.:
422.5
SMILES:
CN1CCN(CC1)S(=O)(=O)c1ccc2[nH]c(cc2c1)-c1cc2ccccc2[nH]c1=O
:
Substrate
Name:
poly-Glu/Tyr
Synonyms:
Type:
Random Copolymer
Mol. Mass.:
358.43
Organism:
Description:
poly-Glu/Tyr (4:1). 25 uM ATP/10 uCi [gamma-33P]ATP as co-substrate.
Residue:
3
NA