Target
5-hydroxytryptamine receptor 2A
Ligand
BDBM180697
Substrate
Meas. Tech.
Radioligand Binding Assay
Ki
2.224±n/a nM
Citation
 Gobbi, LJaeschke, GRoche, OSarmiento, RMSteward, L Dual modulators of 5HT2A and D3 receptors US Patent  US8829029 Publication Date 9/9/2014 
Target
Name:
5-hydroxytryptamine receptor 2A
Synonyms:
5-HT-2 5-HT2A 5-hydroxytryptamine receptor 2A (5HT-2A) 5HT2A_HUMAN HTR2A | Serotonin receptor 2A
Type:
undefined
Mol. Mass.:
52607.65
Organism:
Homo sapiens (Human)
Description:
P28223
Residue:
471
  
Inhibitor
Name:
BDBM180697
Synonyms:
US8829029, 1
Type:
Small organic molecule
Emp. Form.:
C22H30FN3O2
Mol. Mass.:
387.4909
SMILES:
CC(=O)N[C@H]1CC[C@H](CCN2CCC(CC2)c2noc3cc(F)ccc23)CC1
: