Target
5-hydroxytryptamine receptor 2A
Ligand
BDBM180733
Substrate
Meas. Tech.
Radioligand Binding Assay
Ki
5.829±n/a nM
Citation
 Gobbi, LJaeschke, GRoche, OSarmiento, RMSteward, L Dual modulators of 5HT2A and D3 receptors US Patent  US8829029 Publication Date 9/9/2014 
Target
Name:
5-hydroxytryptamine receptor 2A
Synonyms:
5-HT-2 5-HT2A 5-hydroxytryptamine receptor 2A (5HT-2A) 5HT2A_HUMAN HTR2A | Serotonin receptor 2A
Type:
undefined
Mol. Mass.:
52607.65
Organism:
Homo sapiens (Human)
Description:
P28223
Residue:
471
  
Inhibitor
Name:
BDBM180733
Synonyms:
US8829029, 34
Type:
Small organic molecule
Emp. Form.:
C27H38ClN3O3
Mol. Mass.:
488.062
SMILES:
Clc1ccc2c(noc2c1)C1CCN(CC[C@H]2CC[C@@H](CC2)NC(=O)CC2CCCCO2)CC1
: