Target
D(3) dopamine receptor
Ligand
BDBM180723
Substrate
Meas. Tech.
Radioligand Binding Assay
Ki
2.746±n/a nM
Citation
 Gobbi, LJaeschke, GRoche, OSarmiento, RMSteward, L Dual modulators of 5HT2A and D3 receptors US Patent  US8829029 Publication Date 9/9/2014 
Target
Name:
D(3) dopamine receptor
Synonyms:
DOPAMINE D3 DRD3_HUMAN Dopamine D3 receptor (D3) Dopamine receptor Dopamine receptor D3
Type:
Mol. Mass.:
44243.43
Organism:
Homo sapiens (Human)
Description:
Residue:
400
  
Inhibitor
Name:
BDBM180723
Synonyms:
US8829029, 23
Type:
Small organic molecule
Emp. Form.:
C28H32FN3O4
Mol. Mass.:
493.5698
SMILES:
Fc1ccc2c(noc2c1)C1CCN(CC[C@H]2CC[C@@H](CC2)NC(=O)c2ccc3OCOc3c2)CC1
: