Target
(S)-6-hydroxynicotine oxidase
Ligand
BDBM181055
Substrate
Meas. Tech.
Steady-State Kinetics
pH
8±n/a
Kd
4.600e+6± 1.600e+6 nM
Comments
extracted
Citation
 Fitzpatrick, PFChadegani, FZhang, SRoberts, KMHinck, CS Mechanism of the Flavoprotein l-Hydroxynicotine Oxidase: Kinetic Mechanism, Substrate Specificity, Reaction Product, and Roles of Active-Site Residues. Biochemistry 55:697-703 (2016)  
Target
Name:
(S)-6-hydroxynicotine oxidase
Synonyms:
L‐Hydroxynicotine oxidase (LHNO)
Type:
Protein
Mol. Mass.:
46260.18
Organism:
Arthrobacter nicotinovorans
Description:
O86101
Residue:
425
  
Inhibitor
Name:
BDBM181055
Synonyms:
(S)-nornicotine
Type:
Small organic molecule
Emp. Form.:
C9H13N2
Mol. Mass.:
149.2124
SMILES:
C1C[NH2+][C@@H](C1)c1cccnc1
: