Target
Phosphoenolpyruvate carboxykinase, cytosolic [GTP]
Ligand
BDBM181109
Substrate
OAA
Meas. Tech.
PEPCK Assay (OAA to PEP)
Temperature
298.15±0 K
Ki
4.5e+4± 5e+3 nM
Citation
 Balan, MDMcleod, MJLotosky, WRGhaly, MHolyoak, T Inhibition and Allosteric Regulation of Monomeric Phosphoenolpyruvate Carboxykinase by 3-Mercaptopicolinic Acid. Biochemistry 54:5878-87 (2015)  
Target
Name:
Phosphoenolpyruvate carboxykinase, cytosolic [GTP]
Synonyms:
Cytosolic phosphoenolpyruvate carboxykinase (cPEPCK) PEPCK-C Phosphoenolpyruvate carboxykinase (PEPCK) Phosphoenolpyruvate carboxylase
Type:
Protein
Mol. Mass.:
69414.48
Organism:
Rattus norvegicus (Rat)
Description:
Residue:
622
  
Inhibitor
Name:
BDBM181109
Synonyms:
3-Mercaptopicolinic acid (MPA)
Type:
Small organic molecule
Emp. Form.:
C6H5NO2S
Mol. Mass.:
155.174
SMILES:
OC(=O)c1ncccc1S
:
Substrate
Name:
BDBM23230
Synonyms:
2-Oxosuccinic acid Oxaloacetate keto-Oxaloacetate
Type:
Small organic molecule
Emp. Form.:
C4H4O5
Mol. Mass.:
132.0716
SMILES:
OC(=O)CC(=O)C(O)=O
: