Target
Phosphoenolpyruvate carboxykinase, cytosolic [GTP]
Ligand
BDBM181109
Substrate
GDP
Meas. Tech.
PEPCK Assay (PEP to OAA-allosteric)
Temperature
298.15±0 K
Ki
8.3e+4± 7e+3 nM
Citation
 Balan, MDMcleod, MJLotosky, WRGhaly, MHolyoak, T Inhibition and Allosteric Regulation of Monomeric Phosphoenolpyruvate Carboxykinase by 3-Mercaptopicolinic Acid. Biochemistry 54:5878-87 (2015)  
Target
Name:
Phosphoenolpyruvate carboxykinase, cytosolic [GTP]
Synonyms:
Cytosolic phosphoenolpyruvate carboxykinase (cPEPCK) PEPCK-C Phosphoenolpyruvate carboxykinase (PEPCK) Phosphoenolpyruvate carboxylase
Type:
Protein
Mol. Mass.:
69414.48
Organism:
Rattus norvegicus (Rat)
Description:
Residue:
622
  
Inhibitor
Name:
BDBM181109
Synonyms:
3-Mercaptopicolinic acid (MPA)
Type:
Small organic molecule
Emp. Form.:
C6H5NO2S
Mol. Mass.:
155.174
SMILES:
OC(=O)c1ncccc1S
:
Substrate
Name:
BDBM92459
Synonyms:
CHEMBL384759 Guanosine Diphosphate
Type:
Small molecule
Emp. Form.:
C10H15N5O11P2
Mol. Mass.:
443.2005
SMILES:
Nc1nc2n(cnc2c(=O)[nH]1)[C@@H]1O[C@H](COP(O)(=O)OP(O)(O)=O)[C@@H](O)[C@H]1O
: