Target
Phosphoenolpyruvate carboxykinase, cytosolic [GTP]
Ligand
BDBM181109
Substrate
BDBM181111
Meas. Tech.
PEPCK Assay (PEP to OAA)
Temperature
298.15±0 K
Ki
8.3e+4± 6e+3 nM
Citation
 Balan, MDMcleod, MJLotosky, WRGhaly, MHolyoak, T Inhibition and Allosteric Regulation of Monomeric Phosphoenolpyruvate Carboxykinase by 3-Mercaptopicolinic Acid. Biochemistry 54:5878-87 (2015)  
Target
Name:
Phosphoenolpyruvate carboxykinase, cytosolic [GTP]
Synonyms:
Cytosolic phosphoenolpyruvate carboxykinase (cPEPCK) PEPCK-C Phosphoenolpyruvate carboxykinase (PEPCK) Phosphoenolpyruvate carboxylase
Type:
Protein
Mol. Mass.:
69414.48
Organism:
Rattus norvegicus (Rat)
Description:
Residue:
622
  
Inhibitor
Name:
BDBM181109
Synonyms:
3-Mercaptopicolinic acid (MPA)
Type:
Small organic molecule
Emp. Form.:
C6H5NO2S
Mol. Mass.:
155.174
SMILES:
OC(=O)c1ncccc1S
:
Substrate
Name:
BDBM181111
Synonyms:
PEP
Type:
Small organic molecule
Emp. Form.:
C3H4O6P
Mol. Mass.:
167.0346
SMILES:
OP(O)(=O)OC(=C)C([O-])=O
: