Target
Vascular endothelial growth factor receptor 2
Ligand
BDBM5408
Substrate
poly-Glu/Tyr
Meas. Tech.
Kinase Inhibition Assay
pH
7.4±n/a
Temperature
295.15±n/a K
IC50
232±n/a nM
Citation
 Fraley, MERubino, RSHoffman, WFHambaugh, SRArrington, KLHungate, RWBilodeau, MTTebben, AJRutledge, RZKendall, RLMcFall, RCHuckle, WRColl, KEThomas, KA Optimization of a pyrazolo[1,5-a]pyrimidine class of KDR kinase inhibitors: improvements in physical properties enhance cellular activity and pharmacokinetics. Bioorg Med Chem Lett 12:3537-41 (2002)  
Target
Name:
Vascular endothelial growth factor receptor 2
Synonyms:
CD_antigen=CD309 Fetal liver kinase 1 (FLK-1) KDR Protein-tyrosine kinase receptor Flk-1 VEGFR-2 VEGFR2 Vascular Endothelial Growth Factor Receptor Kinase 2 Vascular endothelial growth factor receptor 2 (KDR) Vascular endothelial growth factor receptor 2 (VEGFR2) Vascular endothelial growth factor receptor-2 (VEGFR-2)
Type:
Receptor Tyrosine Kinase
Mol. Mass.:
151510.97
Organism:
Homo sapiens (Human)
Description:
P35968
Residue:
1356
  
Inhibitor
Name:
BDBM5408
Synonyms:
1-{2-[(3,5-dimethylphenyl)amino]pyrimidin-4-yl}-1H-imidazole-2-carbonitrile | 2,4-Disubstituted Pyrimidine 5j
Type:
Small organic molecule
Emp. Form.:
C16H14N6
Mol. Mass.:
290.3226
SMILES:
Cc1cc(C)cc(Nc2nccc(n2)-n2ccnc2C#N)c1
:
Substrate
Name:
poly-Glu/Tyr
Synonyms:
Type:
Random Copolymer
Mol. Mass.:
358.43
Organism:
Description:
poly-Glu/Tyr (4:1). 25 uM ATP/10 uCi [gamma-33P]ATP as co-substrate.
Residue:
3
NA