Target
Histone deacetylase 1
Ligand
BDBM182737
Substrate
Meas. Tech.
HDAC Enzyme Assay
pH
7.4±n/a
IC50
3.1±n/a nM
Comments
extracted
Citation
 van Duzer, JHMazitschek, R Selective HDAC1 and HDAC2 inhibitors US Patent  US9145412 Publication Date 9/29/2015 
Target
Name:
Histone deacetylase 1
Synonyms:
Cereblon/Histone deacetylase 1 HDAC1 Histone deacetylase 1 (HDAC1) RPD3L1
Type:
Enzyme
Mol. Mass.:
55090.27
Organism:
Homo sapiens (Human)
Description:
Q13547
Residue:
482
  
Inhibitor
Name:
BDBM182737
Synonyms:
US9145412, Table 1, Compound 3
Type:
Small organic molecule
Emp. Form.:
C27H27N5OS
Mol. Mass.:
469.601
SMILES:
Nc1ccc(cc1NC(=O)c1cnc2c(C3CC3)c(ccc2c1)N1CCNCC1)-c1cccs1
: