Target
Histone deacetylase 1
Ligand
BDBM182752
Substrate
Meas. Tech.
HDAC Enzyme Assay
pH
7.4±n/a
IC50
7.1±n/a nM
Comments
extracted
Citation
 van Duzer, JHMazitschek, R Selective HDAC1 and HDAC2 inhibitors US Patent  US9145412 Publication Date 9/29/2015 
Target
Name:
Histone deacetylase 1
Synonyms:
Cereblon/Histone deacetylase 1 HDAC1 Histone deacetylase 1 (HDAC1) RPD3L1
Type:
Enzyme
Mol. Mass.:
55090.27
Organism:
Homo sapiens (Human)
Description:
Q13547
Residue:
482
  
Inhibitor
Name:
BDBM182752
Synonyms:
US9145412, Table 1, Compound 18
Type:
Small organic molecule
Emp. Form.:
C27H30N6O
Mol. Mass.:
454.5667
SMILES:
CN1CCN(CCn2ncc3cc(ccc23)C(=O)Nc2cc(ccc2N)-c2ccccc2)CC1
: