Target
Histone deacetylase 1
Ligand
BDBM182760
Substrate
Meas. Tech.
HDAC Enzyme Assay
pH
7.4±n/a
IC50
6±n/a nM
Comments
extracted
Citation
 van Duzer, JHMazitschek, R Selective HDAC1 and HDAC2 inhibitors US Patent  US9145412 Publication Date 9/29/2015 
Target
Name:
Histone deacetylase 1
Synonyms:
Cereblon/Histone deacetylase 1 HDAC1 Histone deacetylase 1 (HDAC1) RPD3L1
Type:
Enzyme
Mol. Mass.:
55090.27
Organism:
Homo sapiens (Human)
Description:
Q13547
Residue:
482
  
Inhibitor
Name:
BDBM182760
Synonyms:
US9145412, Table 1, Compound 47
Type:
Small organic molecule
Emp. Form.:
C27H29N5O2S
Mol. Mass.:
487.616
SMILES:
Nc1ccc(cc1NC(=O)c1cnc2n(CCN3CCOCC3)c(cc2c1)C1CC1)-c1cccs1
: